{"text_format":"1","workbook":"xlsx","n_sheets":24,"sheets":["Welcome!","Planning Parameters","Required Funds","Sources of Capital","Gross Margins","Sales Forecast","Monthly Budget","Opening Balance Sheet","Year 1 Cash Flow Simulator","Summary Financial Projections","Year End Summary","Break-Even","Yr 1 Income Statement","Yr 1 Cash Flow Statement","Yr 1 Balance Sheet","Yr 2 Income Statement","Yr 2 Cash Flow Statement","Yr 2 Balance Sheet","Yr 3 Income Statement","Yr 3 Cash Flow Statement","Yr 3 Balance Sheet","Ratios","Year 4 Loan Payments","Simulator CalcSheet"],"not_rendered":{"charts":1,"images":1,"macros":1,"external_links":0,"defined_names":20,"comments":18,"pivot_tables":0},"unopened":[],"bounds":{"document_bytes":16777216,"sheet_cells":100000,"rows_first":2000,"rows_last":500,"rows_between":2000,"halvings":0,"cell_chars":16384,"cell_head_chars":4096},"cells_cut":0,"cells_raw":0,"read":"whole","date_system":"1900"}

{"sheet":"Welcome!","index":0,"n_rows":38,"n_cols":2,"rows_kept":38,"cut":false,"hidden":false,"merged":[]}
[null,"Welcome:"]
[]
[null,"This spreadsheet walks you through the process of developing an integrated set of financial projections."]
[null,"To use this model, simply complete any information asked for found in the color blue."]
[null,"Otherwise any information found in black type is automatically calculated for you - do not overwrite the formulas!"]
[]
[null,"Also, many cells have comments provided to clarify certain types of information."]
[null,"These comments can be viewed by finding the red arrow as shown below:"]
{"$rows_left_out":31}
{"sheet":"Planning Parameters","index":1,"n_rows":31,"n_cols":16,"rows_kept":31,"cut":false,"hidden":false,"merged":[[6,2,6,3],[4,2,4,3]]}
[{"$f":"'Welcome!'!B18","v":0}]
["Planning Parameters"]
[]
["Business Entity"]
["What is the Business Entity legal structure?",null,"Sole Proprietor/Partnership"]
[]
["How will the business be taxed?",null,"Sole Proprietor/Partnership",null,{"$f":"IF(OR(AND(C5=\"Sole Proprietor/Partnership\",OR(C7=\"S-Corp\",C7=\"C-Corp\")),AND(C5=\"LLC\",C7=\"C-Corp\"),AND(C5=\"Corporation\",C7=\"Sole Proprietor/Partnership\")),\"<== Error in Entity/Tax Selection\",\" \")","v":" "},null,null,null,null,null,null,null,null,null,null,{"$f":"IF(C7=\"C-Corp\",\"Y\",\"N\")","v":"N"}]
[]
{"$rows_left_out":24}
{"sheet":"Required Funds","index":2,"n_rows":36,"n_cols":10,"rows_kept":36,"cut":false,"hidden":false,"merged":[]}
[{"$f":"'Welcome!'!B18","v":0}]
["Initial Required Funds"]
[]
[]
["How much initial money do you require and what will it be used for? "]
["Be sure to include state and local sales and use taxes where applicable."]
[]
["Item","Amount",null,"Totals","Depreciation",null,null,"Monthly Depreciation"]
{"$rows_left_out":29}
{"sheet":"Sources of Capital","index":3,"n_rows":34,"n_cols":4,"rows_kept":34,"cut":false,"hidden":false,"merged":[]}
[{"$f":"'Welcome!'!B18","v":0}]
["Sources of Capital"]
[]
[]
["Funds Required: (from previous statement)"]
["   -Operating Capital",{"$f":"'Required Funds'!D33-'Required Funds'!B11-'Required Funds'!B12","v":0}]
["   -Buildings and Real Estate Mortgage",{"$f":"'Required Funds'!B11+'Required Funds'!B12","v":0}]
["Total Funds Required",{"$f":"SUM(B6:B7)","v":0}]
{"$rows_left_out":27}
{"sheet":"Gross Margins","index":4,"n_rows":79,"n_cols":4,"rows_kept":79,"cut":false,"hidden":false,"merged":[]}
[{"$f":"'Welcome!'!B18","v":0}]
["Gross Margins"]
[]
[]
["What are the direct costs for producing your products and services and what margins will you achieve?"]
[]
["Product / Service Category 1",null,"Dollars","Percent"]
["   -Type of Units","Products"]
{"$rows_left_out":72}
{"sheet":"Sales Forecast","index":5,"n_rows":30,"n_cols":18,"rows_kept":30,"cut":false,"hidden":false,"merged":[]}
[{"$f":"'Welcome!'!B18","v":0}]
["Sales Forecast"]
[]
[]
[]
["Year One"]
["Product/Service","Type of Units","Jan","Feb","Mar","Apr","May","Jun","Jul","Aug","Sep","Oct","Nov","Dec","Total"]
[]
{"$rows_left_out":23}
{"sheet":"Monthly Budget","index":6,"n_rows":36,"n_cols":14,"rows_kept":36,"cut":false,"hidden":false,"merged":[]}
[{"$f":"'Welcome!'!B18","v":0}]
["Monthly Operating Budget"]
[]
[null,null,"Year 1",null,null,"Year 2",null,null,"Year 3"]
[]
["Number of Employees >$1,500 Annual Salary",null,0,null,null,0,null,null,0]
[]
["Salaries and Wages",null,"Monthly (Fixed)","Annual (Fixed)",null,"Monthly (Fixed)","Annual (Fixed)",null,"Monthly (Fixed)","Annual (Fixed)",null,null,"Rate","Wage Base Limit"]
{"$rows_left_out":29}
{"sheet":"Opening Balance Sheet","index":7,"n_rows":42,"n_cols":7,"rows_kept":42,"cut":false,"hidden":false,"merged":[]}
[{"$f":"'Welcome!'!B18","v":0}]
["Current Balance Sheet  (Existing Business Only)"]
["For the period ending on"]
[]
[]
["Please list the value of your business assets in dollars:"]
[]
["Assets  (Stuff you have)"]
{"$rows_left_out":35}
{"sheet":"Year 1 Cash Flow Simulator","index":8,"n_rows":38,"n_cols":9,"rows_kept":38,"cut":false,"hidden":false,"merged":[]}
[{"$f":"'Welcome!'!B18","v":0}]
["Year One Cash Flow Simulator"]
[]
[]
[]
[]
[]
[]
{"$rows_left_out":31}
{"sheet":"Summary Financial Projections","index":9,"n_rows":50,"n_cols":9,"rows_kept":50,"cut":false,"hidden":false,"merged":[]}
[]
["Summary of Financial Projections"]
[]
[{"$f":"'Welcome!'!B18","v":0}]
[]
[]
[null,"Project Requirements:"]
[]
{"$rows_left_out":43}
{"sheet":"Year End Summary","index":10,"n_rows":61,"n_cols":11,"rows_kept":61,"cut":false,"hidden":false,"merged":[]}
[{"$f":"'Welcome!'!B18","v":0}]
["Income Statements"]
[]
[]
[]
["YEAR END SUMMARY"]
[null,null,null,{"$f":"'Monthly Budget'!C4","v":"Year 1"},"%",null,{"$f":"'Monthly Budget'!F4","v":"Year 2"},"%",null,{"$f":"'Monthly Budget'!I4","v":"Year 3"},"%"]
[]
{"$rows_left_out":54}
{"sheet":"Break-Even","index":11,"n_rows":28,"n_cols":4,"rows_kept":28,"cut":false,"hidden":false,"merged":[]}
[{"$f":"'Welcome!'!B18","v":0}]
["Break-Even Analysis Statement"]
[]
[]
["Annual Fixed Costs:",{"$f":"'Yr 1 Income Statement'!O46+'Yr 1 Income Statement'!O51+'Yr 1 Income Statement'!O26","v":0}]
[]
["Cost of Sales as a Percent of Sales:",{"$f":"'Yr 1 Income Statement'!P16","v":0}]
["Contribution Margin as a Percent of Sales:",{"$f":"'Yr 1 Income Statement'!P18","v":0}]
{"$rows_left_out":21}
{"sheet":"Yr 1 Income Statement","index":12,"n_rows":65,"n_cols":16,"rows_kept":65,"cut":false,"hidden":false,"merged":[]}
[{"$f":"'Welcome!'!B18","v":0}]
[]
[{"$f":"CONCATENATE('Monthly Budget'!C4,\" \",\"PROJECTED INCOME STATEMENT\")","v":"Year 1 PROJECTED INCOME STATEMENT"}]
[null,null,{"$f":"'Sales Forecast'!C7","v":"Jan"},{"$f":"'Sales Forecast'!D7","v":"Feb"},{"$f":"'Sales Forecast'!E7","v":"Mar"},{"$f":"'Sales Forecast'!F7","v":"Apr"},{"$f":"'Sales Forecast'!G7","v":"May"},{"$f":"'Sales Forecast'!H7","v":"Jun"},{"$f":"'Sales Forecast'!I7","v":"Jul"},{"$f":"'Sales Forecast'!J7","v":"Aug"},{"$f":"'Sales Forecast'!K7","v":"Sep"},{"$f":"'Sales Forecast'!L7","v":"Oct"},{"$f":"'Sales Forecast'!M7","v":"Nov"},{"$f":"'Sales Forecast'!N7","v":"Dec"},"Totals","%"]
[]
["Income:"]
[null,{"$f":"IF('Gross Margins'!A7<>0,'Gross Margins'!A7,\" \")","v":"Product / Service Category 1"},{"$f":"'Sales Forecast'!C9*'Gross Margins'!$C$9","v":0},{"$f":"'Sales Forecast'!D9*'Gross Margins'!$C$9","v":0},{"$f":"'Sales Forecast'!E9*'Gross Margins'!$C$9","v":0},{"$f":"'Sales Forecast'!F9*'Gross Margins'!$C$9","v":0},{"$f":"'Sales Forecast'!G9*'Gross Margins'!$C$9","v":0},{"$f":"'Sales Forecast'!H9*'Gross Margins'!$C$9","v":0},{"$f":"'Sales Forecast'!I9*'Gross Margins'!$C$9","v":0},{"$f":"'Sales Forecast'!J9*'Gross Margins'!$C$9","v":0},{"$f":"'Sales Forecast'!K9*'Gross Margins'!$C$9","v":0},{"$f":"'Sales Forecast'!L9*'Gross Margins'!$C$9","v":0},{"$f":"'Sales Forecast'!M9*'Gross Margins'!$C$9","v":0},{"$f":"'Sales Forecast'!N9*'Gross Margins'!$C$9","v":0},{"$f":"SUM(C7:N7)","v":0}]
[null,{"$f":"IF('Gross Margins'!A26<>0,'Gross Margins'!A26,\" \")","v":"Product / Service Category 2"},{"$f":"'Sales Forecast'!C10*'Gross Margins'!$C$28","v":0},{"$f":"'Sales Forecast'!D10*'Gross Margins'!$C$28","v":0},{"$f":"'Sales Forecast'!E10*'Gross Margins'!$C$28","v":0},{"$f":"'Sales Forecast'!F10*'Gross Margins'!$C$28","v":0},{"$f":"'Sales Forecast'!G10*'Gross Margins'!$C$28","v":0},{"$f":"'Sales Forecast'!H10*'Gross Margins'!$C$28","v":0},{"$f":"'Sales Forecast'!I10*'Gross Margins'!$C$28","v":0},{"$f":"'Sales Forecast'!J10*'Gross Margins'!$C$28","v":0},{"$f":"'Sales Forecast'!K10*'Gross Margins'!$C$28","v":0},{"$f":"'Sales Forecast'!L10*'Gross Margins'!$C$28","v":0},{"$f":"'Sales Forecast'!M10*'Gross Margins'!$C$28","v":0},{"$f":"'Sales Forecast'!N10*'Gross Margins'!$C$28","v":0},{"$f":"SUM(C8:N8)","v":0}]
{"$rows_left_out":58}
{"sheet":"Yr 1 Cash Flow Statement","index":13,"n_rows":42,"n_cols":14,"rows_kept":42,"cut":false,"hidden":false,"merged":[]}
[{"$f":"'Welcome!'!B18","v":0}]
[]
[{"$f":"CONCATENATE('Monthly Budget'!C4,\" \",\"PROJECTED CASH FLOW STATEMENT\")","v":"Year 1 PROJECTED CASH FLOW STATEMENT"}]
[null,{"$f":"'Yr 1 Income Statement'!C4","v":"Jan"},{"$f":"'Yr 1 Income Statement'!D4","v":"Feb"},{"$f":"'Yr 1 Income Statement'!E4","v":"Mar"},{"$f":"'Yr 1 Income Statement'!F4","v":"Apr"},{"$f":"'Yr 1 Income Statement'!G4","v":"May"},{"$f":"'Yr 1 Income Statement'!H4","v":"Jun"},{"$f":"'Yr 1 Income Statement'!I4","v":"Jul"},{"$f":"'Yr 1 Income Statement'!J4","v":"Aug"},{"$f":"'Yr 1 Income Statement'!K4","v":"Sep"},{"$f":"'Yr 1 Income Statement'!L4","v":"Oct"},{"$f":"'Yr 1 Income Statement'!M4","v":"Nov"},{"$f":"'Yr 1 Income Statement'!N4","v":"Dec"},"Totals"]
[]
["Beginning Cash Balance",{"$f":"'Required Funds'!B30+'Opening Balance Sheet'!B9","v":0},{"$f":"B36","v":0},{"$f":"C36","v":0},0,0,0,0,0,0,0,0,0]
[]
[]
{"$rows_left_out":35}
{"sheet":"Yr 1 Balance Sheet","index":14,"n_rows":51,"n_cols":7,"rows_kept":51,"cut":false,"hidden":false,"merged":[]}
[{"$f":"'Welcome!'!B18","v":0}]
[]
[{"$f":"CONCATENATE('Monthly Budget'!C4,\" \",\"PROJECTED BALANCE SHEET\")","v":"Year 1 PROJECTED BALANCE SHEET"}]
[null,null,null,"Base Period",null,"End of Year One"]
["Assets"]
[]
["Current Assets"]
[null,"Cash",null,{"$f":"'Opening Balance Sheet'!B9+'Required Funds'!B30","v":0},null,{"$f":"'Yr 1 Cash Flow Statement'!M36","v":0}]
{"$rows_left_out":44}
{"sheet":"Yr 2 Income Statement","index":15,"n_rows":67,"n_cols":16,"rows_kept":67,"cut":false,"hidden":false,"merged":[]}
[{"$f":"'Welcome!'!B18","v":0}]
[]
[{"$f":"CONCATENATE('Monthly Budget'!F4,\" \",\"PROJECTED INCOME STATEMENT\")","v":"Year 2 PROJECTED INCOME STATEMENT"}]
[null,null,{"$f":"'Sales Forecast'!C7","v":"Jan"},{"$f":"'Sales Forecast'!D7","v":"Feb"},{"$f":"'Sales Forecast'!E7","v":"Mar"},{"$f":"'Sales Forecast'!F7","v":"Apr"},{"$f":"'Sales Forecast'!G7","v":"May"},{"$f":"'Sales Forecast'!H7","v":"Jun"},{"$f":"'Sales Forecast'!I7","v":"Jul"},{"$f":"'Sales Forecast'!J7","v":"Aug"},{"$f":"'Sales Forecast'!K7","v":"Sep"},{"$f":"'Sales Forecast'!L7","v":"Oct"},{"$f":"'Sales Forecast'!M7","v":"Nov"},{"$f":"'Sales Forecast'!N7","v":"Dec"},"Totals","%"]
[]
["Income:"]
[null,{"$f":"IF('Gross Margins'!A7<>0,'Gross Margins'!A7,\" \")","v":"Product / Service Category 1"},{"$f":"'Gross Margins'!$C$16*'Sales Forecast'!C18","v":0},{"$f":"'Gross Margins'!$C$16*'Sales Forecast'!D18","v":0},{"$f":"'Gross Margins'!$C$16*'Sales Forecast'!E18","v":0},{"$f":"'Gross Margins'!$C$16*'Sales Forecast'!F18","v":0},{"$f":"'Gross Margins'!$C$16*'Sales Forecast'!G18","v":0},{"$f":"'Gross Margins'!$C$16*'Sales Forecast'!H18","v":0},{"$f":"'Gross Margins'!$C$16*'Sales Forecast'!I18","v":0},{"$f":"'Gross Margins'!$C$16*'Sales Forecast'!J18","v":0},{"$f":"'Gross Margins'!$C$16*'Sales Forecast'!K18","v":0},{"$f":"'Gross Margins'!$C$16*'Sales Forecast'!L18","v":0},{"$f":"'Gross Margins'!$C$16*'Sales Forecast'!M18","v":0},{"$f":"'Gross Margins'!$C$16*'Sales Forecast'!N18","v":0},{"$f":"SUM(C7:N7)","v":0}]
[null,{"$f":"IF('Gross Margins'!A26<>0,'Gross Margins'!A26,\" \")","v":"Product / Service Category 2"},{"$f":"'Gross Margins'!$C$35*'Sales Forecast'!C19","v":0},{"$f":"'Gross Margins'!$C$35*'Sales Forecast'!D19","v":0},{"$f":"'Gross Margins'!$C$35*'Sales Forecast'!E19","v":0},{"$f":"'Gross Margins'!$C$35*'Sales Forecast'!F19","v":0},{"$f":"'Gross Margins'!$C$35*'Sales Forecast'!G19","v":0},{"$f":"'Gross Margins'!$C$35*'Sales Forecast'!H19","v":0},{"$f":"'Gross Margins'!$C$35*'Sales Forecast'!I19","v":0},{"$f":"'Gross Margins'!$C$35*'Sales Forecast'!J19","v":0},{"$f":"'Gross Margins'!$C$35*'Sales Forecast'!K19","v":0},{"$f":"'Gross Margins'!$C$35*'Sales Forecast'!L19","v":0},{"$f":"'Gross Margins'!$C$35*'Sales Forecast'!M19","v":0},{"$f":"'Gross Margins'!$C$35*'Sales Forecast'!N19","v":0},{"$f":"SUM(C8:N8)","v":0}]
{"$rows_left_out":60}
{"sheet":"Yr 2 Cash Flow Statement","index":16,"n_rows":42,"n_cols":14,"rows_kept":42,"cut":false,"hidden":false,"merged":[]}
[{"$f":"'Welcome!'!B18","v":0}]
[]
[{"$f":"CONCATENATE('Monthly Budget'!F4,\" \",\"PROJECTED CASH FLOW STATEMENT\")","v":"Year 2 PROJECTED CASH FLOW STATEMENT"}]
[null,{"$f":"'Yr 1 Income Statement'!C4","v":"Jan"},{"$f":"'Yr 1 Income Statement'!D4","v":"Feb"},{"$f":"'Yr 1 Income Statement'!E4","v":"Mar"},{"$f":"'Yr 1 Income Statement'!F4","v":"Apr"},{"$f":"'Yr 1 Income Statement'!G4","v":"May"},{"$f":"'Yr 1 Income Statement'!H4","v":"Jun"},{"$f":"'Yr 1 Income Statement'!I4","v":"Jul"},{"$f":"'Yr 1 Income Statement'!J4","v":"Aug"},{"$f":"'Yr 1 Income Statement'!K4","v":"Sep"},{"$f":"'Yr 1 Income Statement'!L4","v":"Oct"},{"$f":"'Yr 1 Income Statement'!M4","v":"Nov"},{"$f":"'Yr 1 Income Statement'!N4","v":"Dec"},"Totals"]
[]
["Beginning Cash Balance",{"$f":"'Yr 2 Balance Sheet'!D8","v":0},{"$f":"B36","v":0},{"$f":"C36","v":0},0,0,0,0,0,0,0,0,0]
[]
[]
{"$rows_left_out":35}
{"sheet":"Yr 2 Balance Sheet","index":17,"n_rows":51,"n_cols":7,"rows_kept":51,"cut":false,"hidden":false,"merged":[]}
[{"$f":"'Welcome!'!B18","v":0}]
[]
[{"$f":"CONCATENATE('Monthly Budget'!F4,\" \",\"PROJECTED BALANCE SHEET\")","v":"Year 2 PROJECTED BALANCE SHEET"}]
[null,null,null,"End of Year One",null,"End of Year Two"]
["Assets"]
[]
["Current Assets"]
[null,"Cash",null,{"$f":"'Yr 1 Balance Sheet'!F8","v":0},null,{"$f":"'Yr 2 Cash Flow Statement'!M36","v":0}]
{"$rows_left_out":44}
{"sheet":"Yr 3 Income Statement","index":18,"n_rows":66,"n_cols":16,"rows_kept":66,"cut":false,"hidden":false,"merged":[]}
[{"$f":"'Welcome!'!B18","v":0}]
[]
[{"$f":"CONCATENATE('Monthly Budget'!I4,\" \",\"PROJECTED INCOME STATEMENT\")","v":"Year 3 PROJECTED INCOME STATEMENT"}]
[null,null,{"$f":"'Sales Forecast'!C7","v":"Jan"},{"$f":"'Sales Forecast'!D7","v":"Feb"},{"$f":"'Sales Forecast'!E7","v":"Mar"},{"$f":"'Sales Forecast'!F7","v":"Apr"},{"$f":"'Sales Forecast'!G7","v":"May"},{"$f":"'Sales Forecast'!H7","v":"Jun"},{"$f":"'Sales Forecast'!I7","v":"Jul"},{"$f":"'Sales Forecast'!J7","v":"Aug"},{"$f":"'Sales Forecast'!K7","v":"Sep"},{"$f":"'Sales Forecast'!L7","v":"Oct"},{"$f":"'Sales Forecast'!M7","v":"Nov"},{"$f":"'Sales Forecast'!N7","v":"Dec"},"Totals","%"]
[]
["Income:"]
[null,{"$f":"IF('Gross Margins'!A7<>0,'Gross Margins'!A7,\" \")","v":"Product / Service Category 1"},{"$f":"'Gross Margins'!$C$20*'Sales Forecast'!C27","v":0},{"$f":"'Gross Margins'!$C$20*'Sales Forecast'!D27","v":0},{"$f":"'Gross Margins'!$C$20*'Sales Forecast'!E27","v":0},{"$f":"'Gross Margins'!$C$20*'Sales Forecast'!F27","v":0},{"$f":"'Gross Margins'!$C$20*'Sales Forecast'!G27","v":0},{"$f":"'Gross Margins'!$C$20*'Sales Forecast'!H27","v":0},{"$f":"'Gross Margins'!$C$20*'Sales Forecast'!I27","v":0},{"$f":"'Gross Margins'!$C$20*'Sales Forecast'!J27","v":0},{"$f":"'Gross Margins'!$C$20*'Sales Forecast'!K27","v":0},{"$f":"'Gross Margins'!$C$20*'Sales Forecast'!L27","v":0},{"$f":"'Gross Margins'!$C$20*'Sales Forecast'!M27","v":0},{"$f":"'Gross Margins'!$C$20*'Sales Forecast'!N27","v":0},{"$f":"SUM(C7:N7)","v":0}]
[null,{"$f":"IF('Gross Margins'!A26<>0,'Gross Margins'!A26,\" \")","v":"Product / Service Category 2"},{"$f":"'Gross Margins'!$C$39*'Sales Forecast'!C28","v":0},{"$f":"'Gross Margins'!$C$39*'Sales Forecast'!D28","v":0},{"$f":"'Gross Margins'!$C$39*'Sales Forecast'!E28","v":0},{"$f":"'Gross Margins'!$C$39*'Sales Forecast'!F28","v":0},{"$f":"'Gross Margins'!$C$39*'Sales Forecast'!G28","v":0},{"$f":"'Gross Margins'!$C$39*'Sales Forecast'!H28","v":0},{"$f":"'Gross Margins'!$C$39*'Sales Forecast'!I28","v":0},{"$f":"'Gross Margins'!$C$39*'Sales Forecast'!J28","v":0},{"$f":"'Gross Margins'!$C$39*'Sales Forecast'!K28","v":0},{"$f":"'Gross Margins'!$C$39*'Sales Forecast'!L28","v":0},{"$f":"'Gross Margins'!$C$39*'Sales Forecast'!M28","v":0},{"$f":"'Gross Margins'!$C$39*'Sales Forecast'!N28","v":0},{"$f":"SUM(C8:N8)","v":0}]
{"$rows_left_out":59}
{"sheet":"Yr 3 Cash Flow Statement","index":19,"n_rows":42,"n_cols":14,"rows_kept":42,"cut":false,"hidden":false,"merged":[]}
[{"$f":"'Welcome!'!B18","v":0}]
[]
[{"$f":"CONCATENATE('Monthly Budget'!I4,\" \",\"PROJECTED CASH FLOW STATEMENT\")","v":"Year 3 PROJECTED CASH FLOW STATEMENT"}]
[null,{"$f":"'Yr 1 Income Statement'!C4","v":"Jan"},{"$f":"'Yr 1 Income Statement'!D4","v":"Feb"},{"$f":"'Yr 1 Income Statement'!E4","v":"Mar"},{"$f":"'Yr 1 Income Statement'!F4","v":"Apr"},{"$f":"'Yr 1 Income Statement'!G4","v":"May"},{"$f":"'Yr 1 Income Statement'!H4","v":"Jun"},{"$f":"'Yr 1 Income Statement'!I4","v":"Jul"},{"$f":"'Yr 1 Income Statement'!J4","v":"Aug"},{"$f":"'Yr 1 Income Statement'!K4","v":"Sep"},{"$f":"'Yr 1 Income Statement'!L4","v":"Oct"},{"$f":"'Yr 1 Income Statement'!M4","v":"Nov"},{"$f":"'Yr 1 Income Statement'!N4","v":"Dec"},"Totals"]
[]
["Beginning Cash Balance",{"$f":"'Yr 3 Balance Sheet'!D8","v":0},{"$f":"B36","v":0},{"$f":"C36","v":0},0,0,0,0,0,0,0,0,0]
[]
[]
{"$rows_left_out":35}
{"sheet":"Yr 3 Balance Sheet","index":20,"n_rows":51,"n_cols":7,"rows_kept":51,"cut":false,"hidden":false,"merged":[]}
[{"$f":"'Welcome!'!B18","v":0}]
[]
[{"$f":"CONCATENATE('Monthly Budget'!I4,\" \",\"PROJECTED BALANCE SHEET\")","v":"Year 3 PROJECTED BALANCE SHEET"}]
[null,null,null,"End of Year Two",null,"End of Year Three"]
["Assets"]
[]
["Current Assets"]
[null,"Cash",null,{"$f":"'Yr 2 Balance Sheet'!F8","v":0},null,{"$f":"'Yr 3 Cash Flow Statement'!M36","v":0}]
{"$rows_left_out":44}
{"sheet":"Ratios","index":21,"n_rows":24,"n_cols":5,"rows_kept":24,"cut":false,"hidden":false,"merged":[]}
[{"$f":"'Welcome!'!B18","v":0}]
["Financial Ratios"]
[]
[]
[null,null,{"$f":"'Monthly Budget'!C4","v":"Year 1"},{"$f":"'Monthly Budget'!F4","v":"Year 2"},{"$f":"'Monthly Budget'!I4","v":"Year 3"}]
["Liquidity"]
[null,"Current Ratio",{"$f":"IFERROR((('Yr 1 Balance Sheet'!F12-'Yr 1 Balance Sheet'!F11)/'Yr 1 Balance Sheet'!F34),0)","v":0},{"$f":"IFERROR((('Yr 2 Balance Sheet'!F12-'Yr 2 Balance Sheet'!F11)/'Yr 2 Balance Sheet'!F34),0)","v":0},{"$f":"IFERROR((('Yr 3 Balance Sheet'!F12-'Yr 3 Balance Sheet'!F11)/'Yr 3 Balance Sheet'!F34),0)","v":0}]
[null,"Quick Ratio",{"$f":"IFERROR((('Yr 1 Balance Sheet'!F8+'Yr 1 Balance Sheet'!F9)/'Yr 1 Balance Sheet'!F34),0)","v":0},{"$f":"IFERROR((('Yr 2 Balance Sheet'!F8+'Yr 2 Balance Sheet'!F9)/'Yr 2 Balance Sheet'!F34),0)","v":0},{"$f":"IFERROR((('Yr 3 Balance Sheet'!F8+'Yr 3 Balance Sheet'!F9)/'Yr 3 Balance Sheet'!F34),0)","v":0}]
{"$rows_left_out":17}
{"sheet":"Year 4 Loan Payments","index":22,"n_rows":17,"n_cols":15,"rows_kept":17,"cut":false,"hidden":true,"merged":[]}
[]
[]
[]
[]
[null,null,{"$f":"'Sales Forecast'!C7","v":"Jan"},{"$f":"'Sales Forecast'!D7","v":"Feb"},{"$f":"'Sales Forecast'!E7","v":"Mar"},{"$f":"'Sales Forecast'!F7","v":"Apr"},{"$f":"'Sales Forecast'!G7","v":"May"},{"$f":"'Sales Forecast'!H7","v":"Jun"},{"$f":"'Sales Forecast'!I7","v":"Jul"},{"$f":"'Sales Forecast'!J7","v":"Aug"},{"$f":"'Sales Forecast'!K7","v":"Sep"},{"$f":"'Sales Forecast'!L7","v":"Oct"},{"$f":"'Sales Forecast'!M7","v":"Nov"},{"$f":"'Sales Forecast'!N7","v":"Dec"},"Total"]
["Year 4 Interest Expense"]
["Less Interest Expense:"]
[{"$f":"'Sources of Capital'!A21","v":"Commercial Note"},null,{"$f":"IFERROR(ABS(IPMT('Sources of Capital'!$B$22/12,C$13,'Sources of Capital'!$B$23,'Sources of Capital'!$B$21)),0)+IFERROR(ABS(IPMT('Opening Balance Sheet'!$D$27/12,C$13,'Opening Balance Sheet'!$E$27,'Opening Balance Sheet'!$B$27)),0)","v":0},{"$f":"IFERROR(ABS(IPMT('Sources of Capital'!$B$22/12,D$13,'Sources of Capital'!$B$23,'Sources of Capital'!$B$21)),0)+IFERROR(ABS(IPMT('Opening Balance Sheet'!$D$27/12,D$13,'Opening Balance Sheet'!$E$27,'Opening Balance Sheet'!$B$27)),0)","v":0},{"$f":"IFERROR(ABS(IPMT('Sources of Capital'!$B$22/12,E$13,'Sources of Capital'!$B$23,'Sources of Capital'!$B$21)),0)+IFERROR(ABS(IPMT('Opening Balance Sheet'!$D$27/12,E$13,'Opening Balance Sheet'!$E$27,'Opening Balance Sheet'!$B$27)),0)","v":0},{"$f":"IFERROR(ABS(IPMT('Sources of Capital'!$B$22/12,F$13,'Sources of Capital'!$B$23,'Sources of Capital'!$B$21)),0)+IFERROR(ABS(IPMT('Opening Balance Sheet'!$D$27/12,F$13,'Opening Balance Sheet'!$E$27,'Opening Balance Sheet'!$B$27)),0)","v":0},{"$f":"IFERROR(ABS(IPMT('Sources of Capital'!$B$22/12,G$13,'Sources of Capital'!$B$23,'Sources of Capital'!$B$21)),0)+IFERROR(ABS(IPMT('Opening Balance Sheet'!$D$27/12,G$13,'Opening Balance Sheet'!$E$27,'Opening Balance Sheet'!$B$27)),0)","v":0},{"$f":"IFERROR(ABS(IPMT('Sources of Capital'!$B$22/12,H$13,'Sources of Capital'!$B$23,'Sources of Capital'!$B$21)),0)+IFERROR(ABS(IPMT('Opening Balance Sheet'!$D$27/12,H$13,'Opening Balance Sheet'!$E$27,'Opening Balance Sheet'!$B$27)),0)","v":0},{"$f":"IFERROR(ABS(IPMT('Sources of Capital'!$B$22/12,I$13,'Sources of Capital'!$B$23,'Sources of Capital'!$B$21)),0)+IFERROR(ABS(IPMT('Opening Balance Sheet'!$D$27/12,I$13,'Opening Balance Sheet'!$E$27,'Opening Balance Sheet'!$B$27)),0)","v":0},{"$f":"IFERROR(ABS(IPMT('Sources of Capital'!$B$22/12,J$13,'Sources of Capital'!$B$23,'Sources of Capital'!$B$21)),0)+IFERROR(ABS(IPMT('Opening Balance Sheet'!$D$27/12,J$13,'Opening Balance Sheet'!$E$27,'Opening Balance Sheet'!$B$27)),0)","v":0},{"$f":"IFERROR(ABS(IPMT('Sources of Capital'!$B$22/12,K$13,'Sources of Capital'!$B$23,'Sources of Capital'!$B$21)),0)+IFERROR(ABS(IPMT('Opening Balance Sheet'!$D$27/12,K$13,'Opening Balance Sheet'!$E$27,'Opening Balance Sheet'!$B$27)),0)","v":0},{"$f":"IFERROR(ABS(IPMT('Sources of Capital'!$B$22/12,L$13,'Sources of Capital'!$B$23,'Sources of Capital'!$B$21)),0)+IFERROR(ABS(IPMT('Opening Balance Sheet'!$D$27/12,L$13,'Opening Balance Sheet'!$E$27,'Opening Balance Sheet'!$B$27)),0)","v":0},{"$f":"IFERROR(ABS(IPMT('Sources of Capital'!$B$22/12,M$13,'Sources of Capital'!$B$23,'Sources of Capital'!$B$21)),0)+IFERROR(ABS(IPMT('Opening Balance Sheet'!$D$27/12,M$13,'Opening Balance Sheet'!$E$27,'Opening Balance Sheet'!$B$27)),0)","v":0},{"$f":"IFERROR(ABS(IPMT('Sources of Capital'!$B$22/12,N$13,'Sources of Capital'!$B$23,'Sources of Capital'!$B$21)),0)+IFERROR(ABS(IPMT('Opening Balance Sheet'!$D$27/12,N$13,'Opening Balance Sheet'!$E$27,'Opening Balance Sheet'!$B$27)),0)","v":0},{"$f":"SUM(C8:N8)","v":0}]
{"$rows_left_out":10}
{"sheet":"Simulator CalcSheet","index":23,"n_rows":50,"n_cols":14,"rows_kept":50,"cut":false,"hidden":true,"merged":[]}
[{"$f":"'Welcome!'!B18","v":0}]
[]
[{"$f":"CONCATENATE('Monthly Budget'!C4,\" \",\"SIMULATED CASH FLOW STATEMENT\")","v":"Year 1 SIMULATED CASH FLOW STATEMENT"}]
[null,{"$f":"'Yr 1 Income Statement'!C4","v":"Jan"},{"$f":"'Yr 1 Income Statement'!D4","v":"Feb"},{"$f":"'Yr 1 Income Statement'!E4","v":"Mar"},{"$f":"'Yr 1 Income Statement'!F4","v":"Apr"},{"$f":"'Yr 1 Income Statement'!G4","v":"May"},{"$f":"'Yr 1 Income Statement'!H4","v":"Jun"},{"$f":"'Yr 1 Income Statement'!I4","v":"Jul"},{"$f":"'Yr 1 Income Statement'!J4","v":"Aug"},{"$f":"'Yr 1 Income Statement'!K4","v":"Sep"},{"$f":"'Yr 1 Income Statement'!L4","v":"Oct"},{"$f":"'Yr 1 Income Statement'!M4","v":"Nov"},{"$f":"'Yr 1 Income Statement'!N4","v":"Dec"},"Total"]
[]
["Beginning Cash Balance",{"$f":"'Required Funds'!B30+'Opening Balance Sheet'!B9","v":0},{"$f":"B36","v":{"$error":"#DIV/0!"}},{"$error":"#DIV/0!"},{"$error":"#DIV/0!"},{"$error":"#DIV/0!"},{"$error":"#DIV/0!"},{"$error":"#DIV/0!"},{"$error":"#DIV/0!"},{"$error":"#DIV/0!"},{"$error":"#DIV/0!"},{"$error":"#DIV/0!"},{"$error":"#DIV/0!"}]
[]
[]
{"$rows_left_out":42}